{"text_format":"1","workbook":"xlsx","n_sheets":15,"sheets":["ReadMe","MECH-SUM","MECH-CHK","MECH-ECONO","MECH-FANSYS-SUM","MECH-FANSYS","MECH-FANSYS-DOC","MECH-LOAD-CALC","MECH-EQ","MECH-EQ BOILER-CHILLER","MECH-EQ HEAT REJECTION","MECH-EQ AIR SYSTEM TERMINALS","MECH-EQ narrow","MECH-EQ AIR SYSTEM TERM old","ALT-MECH-SYS-SUM"],"not_rendered":{"charts":0,"images":0,"macros":1,"external_links":0,"defined_names":217,"comments":3,"pivot_tables":0},"unopened":[],"bounds":{"document_bytes":16777216,"sheet_cells":100000,"rows_first":2000,"rows_last":500,"rows_between":2000,"halvings":0,"cell_chars":16384,"cell_head_chars":4096},"cells_cut":0,"cells_raw":0,"read":"whole","date_system":"1900"}

{"sheet":"ReadMe","index":0,"n_rows":34,"n_cols":2,"rows_kept":34,"cut":false,"hidden":false,"merged":[[31,0,32,0],[0,0,0,1],[1,0,1,1],[9,0,10,0],[13,0,19,0],[21,0,23,0],[24,0,26,0],[24,1,26,1],[27,0,30,0]]}
["Instructions for Electronic Forms"]
["2012 Washington State Energy Code Compliance Forms for Commercial Buildings including R2 & R3 over 3 stories and all R1 "]
[null,"Revised May 2015"]
[null,"     Commercial Provision Chapters 1 - 5 of the 2012 Washington State Energy Code apply to all commercial occupancies, R-2 and R-3 occupanies greater than 3 stories above grade, and R-1 occupancy (all building heights)."]
["Intro","     This file, MECH12-v4.XLSM, has electronic compliance forms for mechanical provisions as defined in Sections C101, C403, C404, and C408. There are two companion files: ENV12-v3.XLSM (Sections C101, C303, C402 and Appendix A envelope requirements), LTG12-v3.XLSM (Section C405 lighting systems requirements). "]
["Energy Code","    This form is a compliance aid and is not a substitute for the full energy code text or specific jurisdiction compliance requirements. Users should refer to the code text and contact the local jurisdiction for complete information. The full 2012 WSEC code text is available for download from the NEEC website:"]
{"$rows_left_out":29}
{"sheet":"MECH-SUM","index":1,"n_rows":116,"n_cols":9,"rows_kept":116,"cut":false,"hidden":false,"merged":[[31,0,31,1],[36,0,36,1],[37,0,39,1],[39,4,39,8],[40,4,40,8],[49,0,49,1],[32,0,32,1],[30,0,30,1],[2,3,2,6],[2,7,2,8],[3,3,3,6],[4,3,4,6],[5,3,5,6],[6,3,6,6],[7,3,7,6],[11,3,12,8],[13,3,13,8],[14,0,14,3],[29,0,29,1]]}
["Mechanical Summary",null,null,null,null,null,null,null,"MECH-SUM"]
[{"$f":"ReadMe!A2","v":"2012 Washington State Energy Code Compliance Forms for Commercial Buildings including R2 & R3 over 3 stories and all R1 "},null,null,null,null,null,null,null,{"$f":"ReadMe!B3","v":"Revised May 2015"}]
["Project Info",null,"Project Address:","1 - This address line will copy onto other forms",null,null,null,"2015-01-01"]
[null,null,null,"1 - This address line will copy onto other forms",null,null,null,"For Building Dept. Use"]
[null,null,null,"1 - This address line will copy onto other forms"]
[null,null,"Applicant Name:","1 - This address line will copy onto other forms"]
{"$rows_left_out":111}
{"sheet":"MECH-CHK","index":2,"n_rows":45,"n_cols":27,"rows_kept":45,"cut":false,"hidden":false,"merged":[[27,7,27,12],[2,2,2,3],[3,0,3,3],[5,0,5,5],[6,0,6,5],[6,7,6,12],[2,9,2,10],[3,7,3,10],[5,7,5,12],[21,21,21,26],[2,16,2,17],[3,14,3,17],[13,14,13,19],[5,14,5,19],[5,21,5,26],[2,23,2,24],[3,21,3,24],[20,21,20,26]]}
["Mechanical Permit Plans Checklist - Page 1 of 4",null,null,null,null,"MECH-CHK",null,"Mechanical Permit Plans Checklist - Page 2 of 4",null,null,null,null,"MECH-CHK",null,"Mechanical Permit Plans Checklist - Page 3 of 4",null,null,null,null,"MECH-CHK",null,"Mechanical Permit Plans Checklist - Page 4 of 4",null,null,null,null,"MECH-CHK"]
[{"$f":"ReadMe!A2","v":"2012 Washington State Energy Code Compliance Forms for Commercial Buildings including R2 & R3 over 3 stories and all R1 "},null,null,null,null,{"$f":"ReadMe!B3","v":"Revised May 2015"},null,{"$f":"ReadMe!A2","v":"2012 Washington State Energy Code Compliance Forms for Commercial Buildings including R2 & R3 over 3 stories and all R1 "},null,null,null,null,{"$f":"ReadMe!B3","v":"Revised May 2015"},null,{"$f":"ReadMe!A2","v":"2012 Washington State Energy Code Compliance Forms for Commercial Buildings including R2 & R3 over 3 stories and all R1 "},null,null,null,null,{"$f":"ReadMe!B3","v":"Revised May 2015"},null,{"$f":"ReadMe!A2","v":"2012 Washington State Energy Code Compliance Forms for Commercial Buildings including R2 & R3 over 3 stories and all R1 "},null,null,null,null,{"$f":"ReadMe!B3","v":"Revised May 2015"}]
["Project Address",null,{"$f":"IF('MECH-SUM'!D3=\"1 - This address line will copy onto other forms\",\"Fill this line out on MECH-SUM\",'MECH-SUM'!D3)","v":"Fill this line out on MECH-SUM"},null,"Date",{"$f":"'MECH-SUM'!H3","v":"2015-01-01"},null,"Project Address",null,{"$f":"C3","v":"Fill this line out on MECH-SUM"},null,"Date",{"$f":"F3","v":"2015-01-01"},null,"Project Address",null,{"$f":"C3","v":"Fill this line out on MECH-SUM"},null,"Date",{"$f":"F3","v":"2015-01-01"},null,"Project Address",null,{"$f":"C3","v":"Fill this line out on MECH-SUM"},null,"Date",{"$f":"F3","v":"2015-01-01"}]
["The following information is necessary to check a permit application for compliance with the mechanicial systems and equipment requirements of the Washington State Energy Code, Commercial Provisions.",null,null,null,null,null,null,{"$f":"A4","v":"The following information is necessary to check a permit application for compliance with the mechanicial systems and equipment requirements of the Washington State Energy Code, Commercial Provisions."},null,null,null,null,null,null,{"$f":"A4","v":"The following information is necessary to check a permit application for compliance with the mechanicial systems and equipment requirements of the Washington State Energy Code, Commercial Provisions."},null,null,null,null,null,null,{"$f":"H4","v":"The following information is necessary to check a permit application for compliance with the mechanicial systems and equipment requirements of the Washington State Energy Code, Commercial Provisions."}]
["Applicable (yes,no,na)","Code Section","Code Provision","Information Required - Must be in permit documents","Location in Documents","Building Department Notes",null,"Applicable (yes,no,na)","Code Section","Code Provision","Information Required - Must be in permit documents","Location in Documents","Building Department Notes",null,"Applicable (yes,no,na)","Code Section","Code Provision","Information Required - Must be in permit documents","Location in Documents","Building Department Notes",null,"Applicable (yes,no,na)","Code Section","Code Provision","Information Required - Must be in permit documents","Location in Documents","Building Department Notes"]
["GENERAL PROVISIONS",null,null,null,null,null,null,"GENERAL PROVISIONS, CONTINUED",null,null,null,null,null,null,"COMPLEX SYSTEMS",null,null,null,null,null,null,"SERVICE WATER HEATING"]
{"$rows_left_out":40}
{"sheet":"MECH-ECONO","index":3,"n_rows":78,"n_cols":4,"rows_kept":78,"cut":false,"hidden":false,"merged":[[19,2,19,3]]}
["Economizer Exception Summary",null,null,"MECH-ECONO"]
[{"$f":"ReadMe!A2","v":"2012 Washington State Energy Code Compliance Forms for Commercial Buildings including R2 & R3 over 3 stories and all R1 "}]
["Project Info","Project Address:",{"$f":"IF('MECH-SUM'!D3=\"1 - This address line will copy onto other forms\",\"Fill this line out on MECH-SUM\",IF('MECH-SUM'!D3=0,\"\",'MECH-SUM'!D3))","v":"Fill this line out on MECH-SUM"},{"$f":"'MECH-SUM'!H3","v":"2015-01-01"}]
[null,null,{"$f":"IF('MECH-SUM'!D4=\"1 - This address line will copy onto other forms\",\"Fill this line out on MECH-SUM\",IF('MECH-SUM'!D4=0,\"\",'MECH-SUM'!D4))","v":"Fill this line out on MECH-SUM"},"For Building Dept. Use"]
[null,null,{"$f":"IF('MECH-SUM'!D5=\"1 - This address line will copy onto other forms\",\"Fill this line out on MECH-SUM\",IF('MECH-SUM'!D5=0,\"\",'MECH-SUM'!D5))","v":"Fill this line out on MECH-SUM"}]
[null,"Applicant Name:",{"$f":"IF('MECH-SUM'!D6=\"1 - This address line will copy onto other forms\",\"Fill this line out on MECH-SUM\",IF('MECH-SUM'!D6=0,\"\",'MECH-SUM'!D6))","v":"Fill this line out on MECH-SUM"}]
{"$rows_left_out":73}
{"sheet":"MECH-FANSYS-SUM","index":4,"n_rows":34,"n_cols":5,"rows_kept":34,"cut":false,"hidden":false,"merged":[[2,3,2,4]]}
["Mechanical Fan System Power Allowance",null,null,null,"MECH-FANSYS-SUM"]
[{"$f":"ReadMe!A2","v":"2012 Washington State Energy Code Compliance Forms for Commercial Buildings including R2 & R3 over 3 stories and all R1 "},null,null,null,{"$f":"ReadMe!B3","v":"Revised May 2015"}]
["Project Info","Project Address:",{"$f":"IF('MECH-SUM'!D3=\"1 - This address line will copy onto other forms\",\"Fill this line out on MECH-SUM\",IF('MECH-SUM'!D3=0,\"\",'MECH-SUM'!D3))","v":"Fill this line out on MECH-SUM"},{"$f":"'MECH-SUM'!H3","v":"2015-01-01"}]
[null,null,{"$f":"IF('MECH-SUM'!D4=\"1 - This address line will copy onto other forms\",\"Fill this line out on MECH-SUM\",IF('MECH-SUM'!D4=0,\"\",'MECH-SUM'!D4))","v":"Fill this line out on MECH-SUM"},"For Building Dept. Use"]
[null,null,{"$f":"IF('MECH-SUM'!D5=\"1 - This address line will copy onto other forms\",\"Fill this line out on MECH-SUM\",IF('MECH-SUM'!D5=0,\"\",'MECH-SUM'!D5))","v":"Fill this line out on MECH-SUM"}]
[null,"Applicant Name:",{"$f":"IF('MECH-SUM'!D6=\"1 - This address line will copy onto other forms\",\"Fill this line out on MECH-SUM\",IF('MECH-SUM'!D6=0,\"\",'MECH-SUM'!D6))","v":"Fill this line out on MECH-SUM"}]
{"$rows_left_out":29}
{"sheet":"MECH-FANSYS","index":5,"n_rows":112,"n_cols":12,"rows_kept":112,"cut":false,"hidden":false,"merged":[[23,3,23,5],[2,4,2,5],[8,2,8,5],[10,2,10,5],[2,2,2,3],[3,2,3,3],[4,2,4,3],[5,2,5,3],[6,2,6,3],[7,2,7,3]]}
["Mechanical Fan System Power Allowance",null,null,null,null,"MECH-FANSYS"]
[{"$f":"ReadMe!A2","v":"2012 Washington State Energy Code Compliance Forms for Commercial Buildings including R2 & R3 over 3 stories and all R1 "},null,null,null,null,{"$f":"ReadMe!B3","v":"Revised May 2015"}]
["Project Info","Project Address:",{"$f":"IF('MECH-SUM'!D3=\"1 - This address line will copy onto other forms\",\"Fill this line out on MECH-SUM\",IF('MECH-SUM'!D3=0,\"\",'MECH-SUM'!D3))","v":"Fill this line out on MECH-SUM"},null,{"$f":"'MECH-SUM'!H3","v":"2015-01-01"}]
[null,null,{"$f":"IF('MECH-SUM'!D4=\"1 - This address line will copy onto other forms\",\"Fill this line out on MECH-SUM\",IF('MECH-SUM'!D4=0,\"\",'MECH-SUM'!D4))","v":"Fill this line out on MECH-SUM"},null,"For Building Dept. Use"]
[null,null,{"$f":"IF('MECH-SUM'!D5=\"1 - This address line will copy onto other forms\",\"Fill this line out on MECH-SUM\",IF('MECH-SUM'!D5=0,\"\",'MECH-SUM'!D5))","v":"Fill this line out on MECH-SUM"}]
[null,"Applicant Name:",{"$f":"IF('MECH-SUM'!D6=\"1 - This address line will copy onto other forms\",\"Fill this line out on MECH-SUM\",IF('MECH-SUM'!D6=0,\"\",'MECH-SUM'!D6))","v":"Fill this line out on MECH-SUM"}]
{"$rows_left_out":107}
{"sheet":"MECH-FANSYS-DOC","index":6,"n_rows":23,"n_cols":4,"rows_kept":23,"cut":false,"hidden":false,"merged":[[3,1,3,2],[4,1,4,2],[6,1,6,2]]}
["Fan Power Allowance Adjustment Factors ",null,null,"MECH-FANSYS-DOC"]
[{"$f":"ReadMe!A2","v":"2012 Washington State Energy Code Compliance Forms for Commercial Buildings including R2 & R3 over 3 stories and all R1 "},null,null,{"$f":"ReadMe!B3","v":"Revised May 2015"}]
[]
[null,"TABLE C403.2.10.1(2)"]
[null,"FAN POWER LIMITATION PRESSURE DROP ADJUSTMENT"]
[null,"Device","Adjustment"]
{"$rows_left_out":18}
{"sheet":"MECH-LOAD-CALC","index":7,"n_rows":9,"n_cols":6,"rows_kept":9,"cut":false,"hidden":false,"merged":[[7,3,7,4],[2,3,2,4],[3,3,3,4],[4,3,4,4],[5,3,5,4],[6,3,6,4]]}
["Design Load Calculation Summary",null,null,null,null,"MECH-LOAD-CALC"]
[{"$f":"ReadMe!A2","v":"2012 Washington State Energy Code Compliance Forms for Commercial Buildings including R2 & R3 over 3 stories and all R1 "}]
["Project Info",null,"Project Address:",{"$f":"IF('MECH-SUM'!D3=\"1 - This address line will copy onto other forms\",\"Fill this line out on MECH-SUM\",IF('MECH-SUM'!D3=0,\"\",'MECH-SUM'!D3))","v":"Fill this line out on MECH-SUM"},null,{"$f":"'MECH-SUM'!H3","v":"2015-01-01"}]
[null,null,null,{"$f":"IF('MECH-SUM'!D4=\"1 - This address line will copy onto other forms\",\"Fill this line out on MECH-SUM\",IF('MECH-SUM'!D4=0,\"\",'MECH-SUM'!D4))","v":"Fill this line out on MECH-SUM"},null,"For Building Dept. Use"]
[null,null,null,{"$f":"IF('MECH-SUM'!D5=\"1 - This address line will copy onto other forms\",\"Fill this line out on MECH-SUM\",IF('MECH-SUM'!D5=0,\"\",'MECH-SUM'!D5))","v":"Fill this line out on MECH-SUM"}]
[null,null,"Applicant Name:",{"$f":"IF('MECH-SUM'!D6=\"1 - This address line will copy onto other forms\",\"Fill this line out on MECH-SUM\",IF('MECH-SUM'!D6=0,\"\",'MECH-SUM'!D6))","v":"Fill this line out on MECH-SUM"}]
{"$rows_left_out":4}
{"sheet":"MECH-EQ","index":8,"n_rows":135,"n_cols":36,"rows_kept":135,"cut":false,"hidden":false,"merged":[[2,14,2,17],[3,14,3,17],[4,14,4,17],[8,0,8,2],[5,3,5,5],[6,3,6,5],[7,3,7,5],[5,14,5,17],[6,14,6,17],[7,14,7,17],[8,12,8,16],[8,17,8,20],[39,3,39,4],[38,3,38,6],[8,3,8,8],[2,7,2,9],[2,3,2,5],[3,3,3,5],[4,3,4,5]]}
["Cooling & Heating Equipment Schedule, Page 1",null,null,null,null,null,null,null,null,"MECH-EQ",null,"Cooling & Heating Equipment Schedule, Page 2",null,null,null,null,null,null,null,null,{"$f":"J1","v":"MECH-EQ"}]
[{"$f":"ReadMe!A2","v":"2012 Washington State Energy Code Compliance Forms for Commercial Buildings including R2 & R3 over 3 stories and all R1 "},null,null,null,null,null,null,null,null,{"$f":"ReadMe!B3","v":"Revised May 2015"},null,{"$f":"A2","v":"2012 Washington State Energy Code Compliance Forms for Commercial Buildings including R2 & R3 over 3 stories and all R1 "},null,null,null,null,null,null,null,null,{"$f":"J2","v":"Revised May 2015"}]
["Project Info",null,"Project Address:",{"$f":"IF('MECH-SUM'!D3=\"1 - This address line will copy onto other forms\",\"Fill this line out on MECH-SUM\",IF('MECH-SUM'!D3=0,\"\",'MECH-SUM'!D3))","v":"Fill this line out on MECH-SUM"},null,null,null,{"$f":"'MECH-SUM'!H3","v":"2015-01-01"},null,null,null,"Project Info",null,"Project Address:",{"$f":"D3","v":"Fill this line out on MECH-SUM"},null,null,null,null,null,{"$f":"H3","v":"2015-01-01"}]
[null,null,null,{"$f":"IF('MECH-SUM'!D4=\"1 - This address line will copy onto other forms\",\"Fill this line out on MECH-SUM\",IF('MECH-SUM'!D4=0,\"\",'MECH-SUM'!D4))","v":"Fill this line out on MECH-SUM"},null,null,"For Building Dept. Use",null,null,null,null,null,null,null,"Fill this line out on MECH-SUM",null,null,null,"For Building Dept. Use"]
[null,null,null,{"$f":"IF('MECH-SUM'!D5=\"1 - This address line will copy onto other forms\",\"Fill this line out on MECH-SUM\",IF('MECH-SUM'!D5=0,\"\",'MECH-SUM'!D5))","v":"Fill this line out on MECH-SUM"},null,null,null,null,null,null,null,null,null,null,"Fill this line out on MECH-SUM"]
[null,null,"Applicant Name:",{"$f":"IF('MECH-SUM'!D6=\"1 - This address line will copy onto other forms\",\"Fill this line out on MECH-SUM\",IF('MECH-SUM'!D6=0,\"\",'MECH-SUM'!D6))","v":"Fill this line out on MECH-SUM"},null,null,null,null,null,null,null,null,null,"Applicant Name:","Fill this line out on MECH-SUM"]
{"$rows_left_out":130}
{"sheet":"MECH-EQ BOILER-CHILLER","index":9,"n_rows":75,"n_cols":9,"rows_kept":75,"cut":false,"hidden":false,"merged":[[20,0,20,8],[9,0,9,7],[2,3,2,5],[3,3,3,5],[4,3,4,5],[5,3,5,5],[6,3,6,5],[7,3,7,5]]}
["Boiler and Chiller Equipment Schedule",null,null,null,null,null,null,null,"MECH-EQ"]
[{"$f":"ReadMe!A2","v":"2012 Washington State Energy Code Compliance Forms for Commercial Buildings including R2 & R3 over 3 stories and all R1 "},null,null,null,null,null,null,null,{"$f":"ReadMe!B3","v":"Revised May 2015"}]
["Project Info",null,"Project Address:",{"$f":"IF('MECH-SUM'!D3=\"1 - This address line will copy onto other forms\",\"Fill this line out on MECH-SUM\",IF('MECH-SUM'!D3=0,\"\",'MECH-SUM'!D3))","v":"Fill this line out on MECH-SUM"},null,null,{"$f":"'MECH-SUM'!H3","v":"2015-01-01"}]
[null,null,null,{"$f":"IF('MECH-SUM'!D4=\"1 - This address line will copy onto other forms\",\"Fill this line out on MECH-SUM\",IF('MECH-SUM'!D4=0,\"\",'MECH-SUM'!D4))","v":"Fill this line out on MECH-SUM"},null,null,"For Building Dept. Use"]
[null,null,null,{"$f":"IF('MECH-SUM'!D5=\"1 - This address line will copy onto other forms\",\"Fill this line out on MECH-SUM\",IF('MECH-SUM'!D5=0,\"\",'MECH-SUM'!D5))","v":"Fill this line out on MECH-SUM"}]
[null,null,"Applicant Name:",{"$f":"IF('MECH-SUM'!D6=\"1 - This address line will copy onto other forms\",\"Fill this line out on MECH-SUM\",IF('MECH-SUM'!D6=0,\"\",'MECH-SUM'!D6))","v":"Fill this line out on MECH-SUM"}]
{"$rows_left_out":70}
{"sheet":"MECH-EQ HEAT REJECTION","index":10,"n_rows":43,"n_cols":18,"rows_kept":43,"cut":false,"hidden":false,"merged":[[20,0,20,9],[21,0,22,0],[21,1,22,1],[21,2,22,2],[21,3,21,5],[21,6,21,9],[2,6,2,9],[9,0,9,9],[10,0,11,0],[10,1,11,1],[10,2,11,2],[10,3,10,5],[10,6,10,9],[2,3,2,5],[3,3,3,5],[4,3,4,5],[5,3,5,5],[6,3,6,5],[7,3,7,5]]}
["Heat Rejection Equipment Schedule",null,null,null,null,null,null,null,null,"MECH-EQ"]
[{"$f":"ReadMe!A2","v":"2012 Washington State Energy Code Compliance Forms for Commercial Buildings including R2 & R3 over 3 stories and all R1 "},null,null,null,null,null,null,null,null,{"$f":"ReadMe!B3","v":"Revised May 2015"}]
["Project Info",null,"Project Address:",{"$f":"IF('MECH-SUM'!D3=\"1 - This address line will copy onto other forms\",\"Fill this line out on MECH-SUM\",IF('MECH-SUM'!D3=0,\"\",'MECH-SUM'!D3))","v":"Fill this line out on MECH-SUM"},null,null,{"$f":"'MECH-SUM'!H3","v":"2015-01-01"}]
[null,null,null,{"$f":"IF('MECH-SUM'!D4=\"1 - This address line will copy onto other forms\",\"Fill this line out on MECH-SUM\",IF('MECH-SUM'!D4=0,\"\",'MECH-SUM'!D4))","v":"Fill this line out on MECH-SUM"},null,null,"For Building Dept. Use"]
[null,null,null,{"$f":"IF('MECH-SUM'!D5=\"1 - This address line will copy onto other forms\",\"Fill this line out on MECH-SUM\",IF('MECH-SUM'!D5=0,\"\",'MECH-SUM'!D5))","v":"Fill this line out on MECH-SUM"}]
[null,null,"Applicant Name:",{"$f":"IF('MECH-SUM'!D6=\"1 - This address line will copy onto other forms\",\"Fill this line out on MECH-SUM\",IF('MECH-SUM'!D6=0,\"\",'MECH-SUM'!D6))","v":"Fill this line out on MECH-SUM"}]
{"$rows_left_out":38}
{"sheet":"MECH-EQ AIR SYSTEM TERMINALS","index":11,"n_rows":56,"n_cols":6,"rows_kept":56,"cut":false,"hidden":false,"merged":[[8,0,9,0],[8,1,9,1],[8,2,9,2],[8,3,8,4],[2,3,2,4],[3,3,3,4],[4,3,4,4],[5,3,5,4],[6,3,6,4],[7,3,7,4]]}
["Multizone Air System Terminal Schedule",null,null,null,null,"MECH-EQ"]
[{"$f":"ReadMe!A2","v":"2012 Washington State Energy Code Compliance Forms for Commercial Buildings including R2 & R3 over 3 stories and all R1 "}]
["Project Info",null,"Project Address:",{"$f":"IF('MECH-SUM'!D3=\"1 - This address line will copy onto other forms\",\"Fill this line out on MECH-SUM\",IF('MECH-SUM'!D3=0,\"\",'MECH-SUM'!D3))","v":"Fill this line out on MECH-SUM"},null,{"$f":"'MECH-SUM'!H3","v":"2015-01-01"}]
[null,null,null,{"$f":"IF('MECH-SUM'!D4=\"1 - This address line will copy onto other forms\",\"Fill this line out on MECH-SUM\",IF('MECH-SUM'!D4=0,\"\",'MECH-SUM'!D4))","v":"Fill this line out on MECH-SUM"},null,"For Building Dept. Use"]
[null,null,null,{"$f":"IF('MECH-SUM'!D5=\"1 - This address line will copy onto other forms\",\"Fill this line out on MECH-SUM\",IF('MECH-SUM'!D5=0,\"\",'MECH-SUM'!D5))","v":"Fill this line out on MECH-SUM"}]
[null,null,"Applicant Name:",{"$f":"IF('MECH-SUM'!D6=\"1 - This address line will copy onto other forms\",\"Fill this line out on MECH-SUM\",IF('MECH-SUM'!D6=0,\"\",'MECH-SUM'!D6))","v":"Fill this line out on MECH-SUM"}]
{"$rows_left_out":51}
{"sheet":"MECH-EQ narrow","index":12,"n_rows":232,"n_cols":13,"rows_kept":232,"cut":false,"hidden":true,"merged":[[13,2,13,4],[2,6,2,8],[9,2,9,4],[10,2,10,4],[11,2,11,4],[12,2,12,4],[14,2,14,4],[15,2,15,4],[16,2,16,4],[17,1,17,7],[27,1,27,7]]}
["Cooling & Heating Equipment Schedule",null,null,null,null,null,null,null,"MECH-EQ"]
[{"$f":"ReadMe!A2","v":"2012 Washington State Energy Code Compliance Forms for Commercial Buildings including R2 & R3 over 3 stories and all R1 "},null,null,null,null,null,null,null,{"$f":"ReadMe!B3","v":"Revised May 2015"}]
["Project Info",null,"Project Address:",{"$f":"IF('MECH-SUM'!D3=\"1 - This address line will copy onto other forms\",\"Fill this line out on MECH-SUM\",'MECH-SUM'!D3)","v":"Fill this line out on MECH-SUM"},null,null,{"$f":"'MECH-SUM'!H3","v":"2015-01-01"}]
[null,null,null,{"$f":"IF('MECH-SUM'!D4=\"1 - This address line will copy onto other forms\",\"Fill this line out on MECH-SUM\",'MECH-SUM'!D4)","v":"Fill this line out on MECH-SUM"},null,null,"For Building Dept. Use"]
[null,null,null,{"$f":"IF('MECH-SUM'!D5=\"1 - This address line will copy onto other forms\",\"Fill this line out on MECH-SUM\",'MECH-SUM'!D5)","v":"Fill this line out on MECH-SUM"}]
[null,null,"Applicant Name:",{"$f":"IF('MECH-SUM'!D6=\"1 - This address line will copy onto other forms\",\"Fill this line out on MECH-SUM\",'MECH-SUM'!D6)","v":"Fill this line out on MECH-SUM"}]
{"$rows_left_out":227}
{"sheet":"MECH-EQ AIR SYSTEM TERM old","index":13,"n_rows":94,"n_cols":10,"rows_kept":94,"cut":false,"hidden":true,"merged":[[8,0,8,5],[8,6,8,9]]}
["Multizone Air System Terminal Schedule",null,null,null,null,null,null,null,null,"MECH-EQ"]
[{"$f":"ReadMe!A2","v":"2012 Washington State Energy Code Compliance Forms for Commercial Buildings including R2 & R3 over 3 stories and all R1 "},null,null,null,null,null,null,null,null,{"$f":"ReadMe!B3","v":"Revised May 2015"}]
["Project Info",null,"Project Address",{"$f":"IF(#REF!=\"1 - This address line will copy onto other forms\",\"Fill this line out on MECH-SUM\",#REF!)","v":{"$error":"#REF!"}},null,null,null,null,null,{"$f":"#REF!","v":{"$error":"#REF!"}}]
[null,null,null,{"$f":"IF(#REF!=\"1 - This address line will copy onto other forms\",\"Fill this line out on MECH-SUM\",#REF!)","v":{"$error":"#REF!"}},null,null,"For Building Dept. Use"]
[null,null,null,{"$f":"IF(#REF!=\"1 - This address line will copy onto other forms\",\"Fill this line out on MECH-SUM\",#REF!)","v":{"$error":"#REF!"}}]
[null,null,"Applicant Name:",{"$f":"IF(#REF!=\"1 - This address line will copy onto other forms\",\"Fill this line out on MECH-SUM\",#REF!)","v":{"$error":"#REF!"}}]
{"$rows_left_out":89}
{"sheet":"ALT-MECH-SYS-SUM","index":14,"n_rows":219,"n_cols":17,"rows_kept":219,"cut":false,"hidden":true,"merged":[[2,5,2,13]]}
["Cooling & Heating Equipment Schedule",null,null,null,null,null,null,null,null,null,null,null,null,"MECH-EQ"]
[{"$f":"ReadMe!A2","v":"2012 Washington State Energy Code Compliance Forms for Commercial Buildings including R2 & R3 over 3 stories and all R1 "},null,null,null,null,null,null,null,null,null,null,null,null,{"$f":"ReadMe!B3","v":"Revised May 2015"}]
["Project Info"]
[]
[]
[]
{"$rows_left_out":213}